BDBM504000 (4-[[8-Amino-6-(4-methylpyridin-3-yl-2,7- naphthyridin-3- yl]amino]phenyl)methanesulfonamide::US11034692, Compound 264
SMILES Cc1ccncc1-c1cc2cc(Nc3ccc(CS(N)(=O)=O)cc3)ncc2c(N)n1
InChI Key InChIKey=ZWXFZNWXLQNYHK-UHFFFAOYSA-N
Data  1 KI
  Tab Delimited (TSV)   2D SDfile   Computed 3D by Vconf -m prep SDfile
Find this compound or compounds like it in BindingDB:
Activity Spreadsheet -- Enzyme Inhibition Constant Data from BindingDB
Found 1 hit for monomerid = 504000
TargetMitogen-activated protein kinase kinase kinase kinase 1(Homo sapiens (Human))
Genentech
US Patent
LigandPNGBDBM504000((4-[[8-Amino-6-(4-methylpyridin-3-yl-2,7- naphthyr...)
Affinity DataKi:  0.134nM. Assay description: Lanth: For the binding assay, 4 ul 2×HPK1 and Eu-anti-GST antibody were added to each well of the assay plate using a Multidrop reagent dispenser. Th...
Ligand InfoPC cidPC sid
In DepthDetails US Patent