BDBM504002 2-(4-[[8-amino-6-(4-methylpyridin-3-yl)- 2,7-naphthyridin-3-yl]amino]-1H-pyrazol- 1-yl)-2-methylpropan-1-ol::US11034692, Compound 266
SMILES Cc1ccncc1-c1cc2cc(Nc3cnn(c3)C(C)(C)CO)ncc2c(N)n1
InChI Key InChIKey=SMHBVESVRMYLNL-UHFFFAOYSA-N
Data  1 KI
  Tab Delimited (TSV)   2D SDfile   Computed 3D by Vconf -m prep SDfile
Find this compound or compounds like it in BindingDB:
Activity Spreadsheet -- Enzyme Inhibition Constant Data from BindingDB
Found 1 hit for monomerid = 504002
TargetMitogen-activated protein kinase kinase kinase kinase 1(Homo sapiens (Human))
Genentech
US Patent
LigandPNGBDBM504002(2-(4-[[8-amino-6-(4-methylpyridin-3-yl)- 2,7-napht...)
Affinity DataKi:  0.118nM. Assay description: Lanth: For the binding assay, 4 ul 2×HPK1 and Eu-anti-GST antibody were added to each well of the assay plate using a Multidrop reagent dispenser. Th...
Ligand InfoPC cidPC sid
In DepthDetails US Patent