BDBM50400201 CHEMBL2180994
SMILES ONC(=O)C(Cc1ccc(F)cc1)C(=O)NCc1ccc(F)cc1
InChI Key InChIKey=RDXBTUMSUACFNS-UHFFFAOYSA-N
Data  1 IC50
  Tab Delimited (TSV)   2D SDfile   Computed 3D by Vconf -m prep SDfile
Find this compound or compounds like it in BindingDB:
Activity Spreadsheet -- Enzyme Inhibition Constant Data from BindingDB
Found 1 hit for monomerid = 50400201
TargetAminopeptidase N(Sus scrofa (Pig))
University Of Lille
Curated by ChEMBL
LigandPNGBDBM50400201(CHEMBL2180994)
Affinity DataIC50:  3.96E+3nM. Assay description: Inhibition of porcine kidney microsomal neutral aminopeptidase using Leu-pNA as substrate preincubated for 10 mins
In DepthDetails ArticlePubMed