BDBM50400205 CHEMBL2180998
SMILES ONC(=O)C(=C/c1ccccc1)\C(=O)NCc1ccncc1
InChI Key InChIKey=AARPXDCRBCEZAI-UVTDQMKNSA-N
Data  1 IC50
  Tab Delimited (TSV)   2D SDfile   Computed 3D by Vconf -m prep SDfile
Find this compound or compounds like it in BindingDB:
Activity Spreadsheet -- Enzyme Inhibition Constant Data from BindingDB
Found 1 hit for monomerid = 50400205
TargetAminopeptidase N(Sus scrofa (Pig))
University Of Lille
Curated by ChEMBL
LigandPNGBDBM50400205(CHEMBL2180998)
Affinity DataIC50:  2.00E+3nM. Assay description: Inhibition of porcine kidney microsomal neutral aminopeptidase using Leu-pNA as substrate preincubated for 10 mins
In DepthDetails ArticlePubMed