BDBM50400790 CHEMBL2203620
SMILES Cc1nc2ccccc2n1[C@H]1C[C@@H]2CSC[C@H](C1)N2CC[C@H](NC(=O)C1CCC1)c1ccccc1
InChI Key InChIKey=FMZALRQZQUKSDO-QYOOZWMWSA-N
Data  1 IC50
  Tab Delimited (TSV)   2D SDfile   Computed 3D by Vconf -m prep SDfile
Find this compound or compounds like it in BindingDB:
Activity Spreadsheet -- Enzyme Inhibition Constant Data from BindingDB
Found 1 hit for monomerid = 50400790
TargetC-C chemokine receptor type 5(Homo sapiens (Human))
TBA
Curated by ChEMBL
LigandPNGBDBM50400790(CHEMBL2203620)
Affinity DataIC50:  21.5nM. Assay description: Displacement of [125I]MIP-1beta from CCR5 receptor
In DepthDetails ArticlePubMed