BDBM50400972 CHEMBL2205702
SMILES C[N+](C)(Cc1ccc(I)cc1)C\C1=C\CCCCCC1
InChI Key InChIKey=ZYTGXTVTAKFJQV-LZYBPNLTSA-N
Data  1 KI
  Tab Delimited (TSV)   2D SDfile   Computed 3D by Vconf -m prep SDfile
Find this compound or compounds like it in BindingDB:
Activity Spreadsheet -- Enzyme Inhibition Constant Data from BindingDB
Found 1 hit for monomerid = 50400972
TargetC-X-C chemokine receptor type 3(Homo sapiens (Human))
Vu University Amsterdam
Curated by ChEMBL
LigandPNGBDBM50400972(CHEMBL2205702)
Affinity DataKi:  1.00E+3nM. Assay description: Displacement of [125I]-CXCL10 from human CXCR3 expressed in HEK293 cells
In DepthDetails ArticlePubMed