BDBM50401413 CHEMBL2207488
SMILES CCCN1CCC(CC1)c1coc2ccccc12
InChI Key InChIKey=RPDHXGXUGMGVAU-UHFFFAOYSA-N
Data  4 KI
  Tab Delimited (TSV)   2D SDfile   Computed 3D by Vconf -m prep SDfile
Find this compound or compounds like it in BindingDB:
Activity Spreadsheet -- Enzyme Inhibition Constant Data from BindingDB
Found 4 hits for monomerid = 50401413
TargetAmine oxidase [flavin-containing] A(Rattus norvegicus (rat))
Neurosearch Sweden
Curated by ChEMBL
LigandPNGBDBM50401413(CHEMBL2207488)
Affinity DataKi:  92nM. Assay description: Displacement of [3H]Ro 41-1049 from MAO-A in rat cerebral cortex by competition binding assay
In DepthDetails ArticlePubMed
TargetD(2) dopamine receptor(Homo sapiens (Human))
Neurosearch Sweden
Curated by ChEMBL
LigandPNGBDBM50401413(CHEMBL2207488)
Affinity DataKi:  803nM. Assay description: Displacement of [3H]7-OH-DPAT from human high affinity Dopamine D2S receptor by competition binding assay
In DepthDetails ArticlePubMed
TargetSodium-dependent serotonin transporter(Homo sapiens (Human))
Neurosearch Sweden
Curated by ChEMBL
LigandPNGBDBM50401413(CHEMBL2207488)
Affinity DataKi:  827nM. Assay description: Displacement of [3H]imipramine from human SERT expressed in CHO cells by competition binding assay
In DepthDetails ArticlePubMed
TargetD(2) dopamine receptor(Homo sapiens (Human))
Neurosearch Sweden
Curated by ChEMBL
LigandPNGBDBM50401413(CHEMBL2207488)
Affinity DataKi:  2.72E+3nM. Assay description: Displacement of [3H]methylspiperone from human low affinity Dopamine D2S receptor by competition binding assay
In DepthDetails ArticlePubMed