BDBM504023 US11034692, Compound 292
SMILES Cc1ccncc1-c1cc2cc(NC(=O)[C@H]3C[C@@H]3c3cnn(CCOCCN)c3)ncc2c(N)n1
InChI Key InChIKey=TWADHMCFVPOEQQ-MOPGFXCFSA-N
Data  1 KI
  Tab Delimited (TSV)   2D SDfile   Computed 3D by Vconf -m prep SDfile
Find this compound or compounds like it in BindingDB:
Activity Spreadsheet -- Enzyme Inhibition Constant Data from BindingDB
Found 1 hit for monomerid = 504023
TargetMitogen-activated protein kinase kinase kinase kinase 1(Homo sapiens (Human))
Genentech
US Patent
LigandPNGBDBM504023(US11034692, Compound 292)
Affinity DataKi:  0.0420nM. Assay description: Lanth: For the binding assay, 4 ul 2×HPK1 and Eu-anti-GST antibody were added to each well of the assay plate using a Multidrop reagent dispenser. Th...
Ligand InfoPC cidPC sid
In DepthDetails US Patent