BDBM50402496 CHEMBL2204045
SMILES COc1ccccc1Cc1c([nH]c(=O)[nH]c1=O)[C@@H]1CC[C@@H](CC1)c1ccccc1
InChI Key InChIKey=NDLLRHKTGJQNKH-HDICACEKSA-N
Data  2 KI
  Tab Delimited (TSV)   2D SDfile   Computed 3D by Vconf -m prep SDfile
Find this compound or compounds like it in BindingDB:
Activity Spreadsheet -- Enzyme Inhibition Constant Data from BindingDB
Found 2 hits for monomerid = 50402496
TargetGlucocorticoid receptor(Homo sapiens (Human))
Corcept Therapeutics
Curated by ChEMBL
LigandPNGBDBM50402496(CHEMBL2204045)
Affinity DataKi:  9nM. Assay description: Displacement of [3H]dexamethasone from human recombinant glucocorticoid receptor expressed in baculovirus after 18 hrs by scintillation counting anal...
In DepthDetails ArticlePubMed
TargetGlucocorticoid receptor(Homo sapiens (Human))
Corcept Therapeutics
Curated by ChEMBL
LigandPNGBDBM50402496(CHEMBL2204045)
Affinity DataKi:  56nM. Assay description: Antagonist activity at glucocorticoid receptor in human SW1353 cells assessed as inhibition of dexamethasone-induced luciferase expression after 16 h...
In DepthDetails ArticlePubMed