BDBM504036 (1S,2S)—N-[8-amino-6-(2-chlorophenyl)-2,7-naphthyridin-3-yl]-2-(1-methyl-1H-pyrazol-4-yl)cyclopropane-1-carboxamide (Compound 304) and (1R,2R)—N-[8-amino-6-(2-chlorophenyl)-2,7-naphthyridin-3-yl]-2-(1-methyl-H-pyrazol-4-yl)cyclopropane-1-carboxamide ::US11034692, Compound 305
SMILES Cn1cc(cn1)[C@H]1C[C@@H]1C(=O)Nc1cc2cc(nc(N)c2cn1)-c1ccccc1Cl
InChI Key InChIKey=GGRFKBROCRKDCN-CVEARBPZSA-N
Data  1 KI
  Tab Delimited (TSV)   2D SDfile   Computed 3D by Vconf -m prep SDfile
Find this compound or compounds like it in BindingDB:
Activity Spreadsheet -- Enzyme Inhibition Constant Data from BindingDB
Found 1 hit for monomerid = 504036
TargetMitogen-activated protein kinase kinase kinase kinase 1(Homo sapiens (Human))
Genentech
US Patent
LigandPNGBDBM504036((1S,2S)—N-[8-amino-6-(2-chlorophenyl)-2,7-nap...)
Affinity DataKi:  0.152nM. Assay description: Lanth: For the binding assay, 4 ul 2×HPK1 and Eu-anti-GST antibody were added to each well of the assay plate using a Multidrop reagent dispenser. Th...
Ligand InfoPC cidPC sid
In DepthDetails US Patent