BDBM50403639 CHEMBL2114154
SMILES NC(CCC(O)=O)C(=O)OC[C@@H]1CCCN1
InChI Key InChIKey=HELBZSXZATWLCE-JAMMHHFISA-N
Data  1 KI
  Tab Delimited (TSV)   2D SDfile   Computed 3D by Vconf -m prep SDfile
Find this compound or compounds like it in BindingDB:
Activity Spreadsheet -- Enzyme Inhibition Constant Data from BindingDB
Found 1 hit for monomerid = 50403639
TargetGlutamine--tRNA ligase(Homo sapiens (Human))
TBA
Curated by ChEMBL
LigandPNGBDBM50403639(CHEMBL2114154)
Affinity DataKi:  1.14E+7nM. Assay description: Compound was tested for the inhibition of Escherichia coli glutamyl-t-RNA synthetase
In DepthDetails Article