BDBM50403877 CHEMBL103105
SMILES Cc1nc2cc3CC[C@H](N(CC#C)c4ccc(cc4)C(=O)N[C@@H](CCCS(=O)(=O)c4nnc[nH]4)C(O)=O)c3cc2c(=O)[nH]1
InChI Key InChIKey=FIZXILPZWMCMSD-ZCYQVOJMSA-N
Data  1 KI
  Tab Delimited (TSV)   2D SDfile   Computed 3D by Vconf -m prep SDfile
Find this compound or compounds like it in BindingDB:
Activity Spreadsheet -- Enzyme Inhibition Constant Data from BindingDB
Found 1 hit for monomerid = 50403877
TargetThymidylate synthase(Mus musculus)
The Institute Of Cancer Research
Curated by ChEMBL
LigandPNGBDBM50403877(CHEMBL103105)
Affinity DataKi:  0.710nM. Assay description: Tested for inhibitory activity against thymidylate synthase of L1210 cells
In DepthDetails ArticlePubMed