BDBM504040 (1S,2S)—N-[8-amino-6-[4-methyl-6-(1,3-oxazol-2-yl)pyridin-3-yl]-2,7-naphthyridin-3-yl]-2-(1-methyl-1H-pyrazol-4-yl)cyclopropane-1-carboxamide (Compound 308) and (1R,2R)—N-[8-amino-6-[4-methyl-6-(1,3-oxazol-2-yl)pyridin-3-yl]-2,7-naphthyridin-3-yl]-2-(1-methyl-1H-pyrazol-4-yl)cyclopropane-1-carboxamide ::US11034692, Compound 309
SMILES Cc1cc(ncc1-c1cc2cc(NC(=O)[C@@H]3C[C@H]3c3cnn(C)c3)ncc2c(N)n1)-c1ncco1
InChI Key InChIKey=DSNQGTOVSLLFQX-DLBZAZTESA-N
Data  1 KI
  Tab Delimited (TSV)   2D SDfile   Computed 3D by Vconf -m prep SDfile
Find this compound or compounds like it in BindingDB:
Activity Spreadsheet -- Enzyme Inhibition Constant Data from BindingDB
Found 1 hit for monomerid = 504040
TargetMitogen-activated protein kinase kinase kinase kinase 1(Homo sapiens (Human))
Genentech
US Patent
LigandPNGBDBM504040((1S,2S)—N-[8-amino-6-[4-methyl-6-(1,3-oxazol-...)
Affinity DataKi:  0.184nM. Assay description: Lanth: For the binding assay, 4 ul 2×HPK1 and Eu-anti-GST antibody were added to each well of the assay plate using a Multidrop reagent dispenser. Th...
Ligand InfoPC cidPC sid
In DepthDetails US Patent