BDBM504041 US11034692, Compound 310
SMILES Nc1nc(cc2cc(NC(=O)[C@H]3C[C@@H]3CC#N)ncc12)-c1c(Cl)cccc1Cl
InChI Key InChIKey=BEEUVRUENQZDAM-JQWIXIFHSA-N
Data  1 KI
  Tab Delimited (TSV)   2D SDfile   Computed 3D by Vconf -m prep SDfile
Find this compound or compounds like it in BindingDB:
Activity Spreadsheet -- Enzyme Inhibition Constant Data from BindingDB
Found 1 hit for monomerid = 504041
TargetMitogen-activated protein kinase kinase kinase kinase 1(Homo sapiens (Human))
Genentech
US Patent
LigandPNGBDBM504041(US11034692, Compound 310)
Affinity DataKi:  0.0680nM. Assay description: Lanth: For the binding assay, 4 ul 2×HPK1 and Eu-anti-GST antibody were added to each well of the assay plate using a Multidrop reagent dispenser. Th...
Ligand InfoPC cidPC sid
In DepthDetails US Patent