BDBM50404220 CHEMBL25261
SMILES Clc1cccc(c1)-c1ccc2NC(=S)C3(CCC3)c2c1
InChI Key InChIKey=NKQALBXOTQZTPF-UHFFFAOYSA-N
Data  1 EC50
  Tab Delimited (TSV)   2D SDfile   Computed 3D by Vconf -m prep SDfile
Find this compound or compounds like it in BindingDB:
Activity Spreadsheet -- Enzyme Inhibition Constant Data from BindingDB
Found 1 hit for monomerid = 50404220
TargetProgesterone receptor(Homo sapiens (Human))
Wyeth Research
Curated by ChEMBL
LigandPNGBDBM50404220(CHEMBL25261)
Affinity DataEC50:  29nM. Assay description: Effective concentration of progesterone receptor agonist induction of alkaline phosphatase activity in human T47D breast carcinoma cells
In DepthDetails ArticlePubMed