BDBM50404988 CHEMBL11171
SMILES CC(C)NCC(O)COc1ccc(cc1)-c1nc(c[nH]1)-c1cccs1
InChI Key InChIKey=PYNHMXVUQLOMJY-UHFFFAOYSA-N
Data  2 Kd
  Tab Delimited (TSV)   2D SDfile   Computed 3D by Vconf -m prep SDfile
Find this compound or compounds like it in BindingDB:
Activity Spreadsheet -- Enzyme Inhibition Constant Data from BindingDB
Found 2 hits for monomerid = 50404988
TargetBeta-2 adrenergic receptor(GUINEA PIG)
TBA
Curated by ChEMBL
LigandPNGBDBM50404988(CHEMBL11171)
Affinity DataKd:  132nM. Assay description: In vitro beta-2 adrenergic receptor activity was determined by measuring inhibition of the isoproterenol induced relaxation in isolated guinea pig tr...
In DepthDetails ArticlePubMed
TargetBeta-1 adrenergic receptor(GUINEA PIG)
TBA
Curated by ChEMBL
LigandPNGBDBM50404988(CHEMBL11171)
Affinity DataKd:  1.20nM. Assay description: In vitro beta-1 adrenergic receptor activity was determined via inhibition of the positive chronotropic actions of isoproterenol in isolated guinea p...
In DepthDetails ArticlePubMed