BDBM504050 US11034692, Compound 318
SMILES Cc1ccnc(-c2ccccc2)c1-c1cc2cc(NC(=O)[C@H]3C[C@@H]3c3cnn(C)c3)ncc2c(N)n1
InChI Key InChIKey=XXIYKUNWUZHKLD-RTWAWAEBSA-N
Data  1 KI
  Tab Delimited (TSV)   2D SDfile   Computed 3D by Vconf -m prep SDfile
Find this compound or compounds like it in BindingDB:
Activity Spreadsheet -- Enzyme Inhibition Constant Data from BindingDB
Found 1 hit for monomerid = 504050
TargetMitogen-activated protein kinase kinase kinase kinase 1(Homo sapiens (Human))
Genentech
US Patent
LigandPNGBDBM504050(US11034692, Compound 318)
Affinity DataKi:  0.0320nM. Assay description: Lanth: For the binding assay, 4 ul 2×HPK1 and Eu-anti-GST antibody were added to each well of the assay plate using a Multidrop reagent dispenser. Th...
Ligand InfoPC cidPC sid
In DepthDetails US Patent