BDBM50405063 CHEMBL427826
SMILES CC1(C)N=C(N)N=C(N)N1c1ccc(cc1)C(F)(F)F
InChI Key InChIKey=ROTRAHDYGVFVQU-UHFFFAOYSA-N
Data  4 KI
  Tab Delimited (TSV)   2D SDfile   Computed 3D by Vconf -m prep SDfile
Find this compound or compounds like it in BindingDB:
Activity Spreadsheet -- Enzyme Inhibition Constant Data from BindingDB
Found 4 hits for monomerid = 50405063
TargetDihydrofolate reductase(Pneumocystis carinii)
Cor Therapeutics
Curated by ChEMBL
LigandPNGBDBM50405063(CHEMBL427826)
Affinity DataKi:  132nM. Assay description: Inhibition of dihydrofolate reductase (DHFR) from Pneumocystis carinii.
In DepthDetails ArticlePubMed
TargetDihydrofolate reductase(Gallus gallus (Chicken))
TBA
Curated by ChEMBL
LigandPNGBDBM50405063(CHEMBL427826)
Affinity DataKi:  170nM. Assay description: Inhibitory activity against isolated chicken liver dihydrofolate reductase (DHFR)
In DepthDetails ArticlePubMed
TargetDihydrofolate reductase(Homo sapiens (Human))
TBA
Curated by ChEMBL
LigandPNGBDBM50405063(CHEMBL427826)
Affinity DataKi:  2.63E+3nM. Assay description: Inhibitory activity against human lymphoblastoid cell (WIL2) dihydrofolate reductase (DHFR)
In DepthDetails ArticlePubMed
TargetDihydrofolate reductase(Lactobacillus casei)
TBA
Curated by ChEMBL
LigandPNGBDBM50405063(CHEMBL427826)
Affinity DataKi:  2.09E+5nM. Assay description: Inhibitory activity against Lactobacillus casei dihydrofolate reductase (DHFR)
In DepthDetails ArticlePubMed