BDBM50405093 CHEMBL33066
SMILES CC1(C)N=C(N)N=C(N)N1c1ccc2CCCCc2c1
InChI Key InChIKey=LSZSAJZDEGCJOE-UHFFFAOYSA-N
Data  1 KI
  Tab Delimited (TSV)   2D SDfile   Computed 3D by Vconf -m prep SDfile
Find this compound or compounds like it in BindingDB:
Activity Spreadsheet -- Enzyme Inhibition Constant Data from BindingDB
Found 1 hit for monomerid = 50405093
TargetDihydrofolate reductase(Gallus gallus (Chicken))
TBA
Curated by ChEMBL
LigandPNGBDBM50405093(CHEMBL33066)
Affinity DataKi:  19nM. Assay description: Inhibitory activity against isolated chicken liver dihydrofolate reductase (DHFR)
In DepthDetails ArticlePubMed