BDBM50405102 CHEMBL30475
SMILES Cc1ccccc1SCc1ccc(cc1)N1C(N)=NC(N)=NC1(C)C
InChI Key InChIKey=YIMNJGMTEZDFCY-UHFFFAOYSA-N
Data  2 KI
  Tab Delimited (TSV)   2D SDfile   Computed 3D by Vconf -m prep SDfile
Find this compound or compounds like it in BindingDB:
Activity Spreadsheet -- Enzyme Inhibition Constant Data from BindingDB
Found 2 hits for monomerid = 50405102
TargetDihydrofolate reductase(Gallus gallus (Chicken))
TBA
Curated by ChEMBL
LigandPNGBDBM50405102(CHEMBL30475)
Affinity DataKi:  43nM. Assay description: Inhibitory activity against isolated chicken liver dihydrofolate reductase (DHFR)
In DepthDetails ArticlePubMed
TargetDihydrofolate reductase(Homo sapiens (Human))
TBA
Curated by ChEMBL
LigandPNGBDBM50405102(CHEMBL30475)
Affinity DataKi:  66nM. Assay description: Inhibitory activity against human lymphoblastoid cell (WIL2) dihydrofolate reductase (DHFR)
In DepthDetails ArticlePubMed