BDBM50405111 CHEMBL73819
SMILES OC(=O)C1CS(=O)(=O)NC(=O)N1
InChI Key InChIKey=RQMNWIPZMMGQNT-UHFFFAOYSA-N
Data  1 IC50
  Tab Delimited (TSV)   2D SDfile   Computed 3D by Vconf -m prep SDfile
Find this compound or compounds like it in BindingDB:
Activity Spreadsheet -- Enzyme Inhibition Constant Data from BindingDB
Found 1 hit for monomerid = 50405111
TargetCAD protein(Mus musculus)
TBA
Curated by ChEMBL
LigandPNGBDBM50405111(CHEMBL73819)
Affinity DataIC50:  5.20E+5nMpH: 7.37Assay Description:Compound was evaluated for the inhibition of dihydroorotase enzyme from mouse Ehrlich ascites at the concentration of 10 uM and at pH 7.37
In DepthDetails ArticlePubMed