BDBM50405135 CHEMBL610147
SMILES O[C@H]1[C@@H](O)C(=O)O[C@@H]1COS([O-])(=O)=O
InChI Key InChIKey=MEAWJAUZKBOUHK-BXXZVTAOSA-M
Data  1 IC50
  Tab Delimited (TSV)   2D SDfile   Computed 3D by Vconf -m prep SDfile
Find this compound or compounds like it in BindingDB:
Activity Spreadsheet -- Enzyme Inhibition Constant Data from BindingDB
Found 1 hit for monomerid = 50405135
TargetArabinose 5-phosphate isomerase KdsD(Salmonella typhimurium)
TBA
Curated by ChEMBL
LigandPNGBDBM50405135(CHEMBL610147)
Affinity DataIC50:  3.59E+7nM. Assay description: Inhibitory activity against Arabinose-5-phosphate isomerase
In DepthDetails ArticlePubMed