BDBM50405376 CHEMBL1627689
SMILES C[C@]12CC[C@H]3[C@@H](CCc4ccc(N)cc34)[C@@H]1CCC2O
InChI Key InChIKey=UJZXODRFSBQSSL-URZDDQNSSA-N
Data  1 KI
  Tab Delimited (TSV)   2D SDfile   Computed 3D by Vconf -m prep SDfile
Find this compound or compounds like it in BindingDB:
Activity Spreadsheet -- Enzyme Inhibition Constant Data from BindingDB
Found 1 hit for monomerid = 50405376
TargetSulfotransferase(Sus scrofa)
TBA
Curated by ChEMBL
LigandPNGBDBM50405376(CHEMBL1627689)
Affinity DataKi:  7.51E+3nM. Assay description: Compound was tested for inhibition of porcine endometrial estrogen sulfotransferase
In DepthDetails ArticlePubMed