BDBM50405382 CHEMBL1627685
SMILES C[C@]12CC[C@H]3[C@@H](CCc4c(N)cccc34)[C@@H]1CCC2=O
InChI Key InChIKey=KFIUHMVRCIWBLC-ONUSSAAZSA-N
Data  1 KI
  Tab Delimited (TSV)   2D SDfile   Computed 3D by Vconf -m prep SDfile
Find this compound or compounds like it in BindingDB:
Activity Spreadsheet -- Enzyme Inhibition Constant Data from BindingDB
Found 1 hit for monomerid = 50405382
TargetSulfotransferase(Sus scrofa)
TBA
Curated by ChEMBL
LigandPNGBDBM50405382(CHEMBL1627685)
Affinity DataKi:  1.05E+4nM. Assay description: Compound was tested for inhibition of porcine endometrial estrogen sulfotransferase
In DepthDetails ArticlePubMed