BDBM504062 (1R,2R)-N-(8-amino-6-(4-methylpyridin- 3-yl)-2,7-naphthyridin-3-yl)-2-(1-(2- methoxyethyl)-1H-pyrazol-4- yl)cyclopropanecarboxamide::US11034692, Compound 330
SMILES COCCn1cc(cn1)[C@@H]1C[C@H]1C(=O)Nc1cc2cc(nc(N)c2cn1)-c1cnccc1C
InChI Key InChIKey=ULYVIFITXVJVHW-ZWKOTPCHSA-N
Data  1 KI
  Tab Delimited (TSV)   2D SDfile   Computed 3D by Vconf -m prep SDfile
Find this compound or compounds like it in BindingDB:
Activity Spreadsheet -- Enzyme Inhibition Constant Data from BindingDB
Found 1 hit for monomerid = 504062
TargetMitogen-activated protein kinase kinase kinase kinase 1(Homo sapiens (Human))
Genentech
US Patent
LigandPNGBDBM504062((1R,2R)-N-(8-amino-6-(4-methylpyridin- 3-yl)-2,7-n...)
Affinity DataKi: <0.0200nM. Assay description: Lanth: For the binding assay, 4 ul 2×HPK1 and Eu-anti-GST antibody were added to each well of the assay plate using a Multidrop reagent dispenser. Th...
Ligand InfoPC cidPC sid
In DepthDetails US Patent