BDBM50406543 CHEMBL4169986
SMILES C1CC2CN(CC1N2)c1cccnc1
InChI Key InChIKey=GFPKENYJHPZLJI-UHFFFAOYSA-N
Data  1 KI
  Tab Delimited (TSV)   2D SDfile   Computed 3D by Vconf -m prep SDfile
Find this compound or compounds like it in BindingDB:
Activity Spreadsheet -- Enzyme Inhibition Constant Data from BindingDB
Found 1 hit for monomerid = 50406543
TargetNeuronal acetylcholine receptor subunit alpha-4/beta-2(Homo sapiens (Human))
Istituto Di Chimica Biomolecolare
Curated by ChEMBL
LigandPNGBDBM50406543(CHEMBL4169986)
Affinity DataKi:  0.400nM. Assay description: Agonist activity at alpha4beta2 nAChR (unknown origin)
In DepthDetails ArticlePubMed