BDBM50407087 CHEMBL2112258
SMILES CC[C@H](C)[C@H](NC(=O)[C@H](CC1CCCCC1)NC(=O)OC(C)(C)C)C(=O)N[C@@H](CC(C)C)[C@@H](O)CC(=O)NCCc1ccccn1
InChI Key InChIKey=QZHUFCAPALTNSM-LRLYEUBCSA-N
Data  3 IC50
  Tab Delimited (TSV)   2D SDfile   Computed 3D by Vconf -m prep SDfile
Find this compound or compounds like it in BindingDB:
Activity Spreadsheet -- Enzyme Inhibition Constant Data from BindingDB
Found 3 hits for monomerid = 50407087
TargetRenin(Homo sapiens (Human))
Abbott Laboratories
Curated by ChEMBL
LigandPNGBDBM50407087(CHEMBL2112258)
Affinity DataIC50: >1.00E+3nMpH: 6.0Assay Description:In vitro inhibition of partially purified human renin at pH 6.0.
In DepthDetails ArticlePubMed
TargetCathepsin D(Bos taurus)
Abbott Laboratories
Curated by ChEMBL
LigandPNGBDBM50407087(CHEMBL2112258)
Affinity DataIC50:  37nM. Assay description: Inhibition of conversion of hemoglobin by commercially purchased bovine spleen cathepsin D.
In DepthDetails ArticlePubMed
TargetEndothelin-converting enzyme 1(Rattus norvegicus (Rat))
Abbott Laboratories
Curated by ChEMBL
LigandPNGBDBM50407087(CHEMBL2112258)
Affinity DataIC50:  5.20nM. Assay description: Inhibition of conversion of big endothelial-1 (Big ET-1) to ET-1 by endothelin converting enzyme(ECE) in rat lung membrane.
In DepthDetails ArticlePubMed