BDBM50407088 CHEMBL2112255
SMILES CC[C@H](C)[C@H](NC(=O)[C@H](CC1CCCCC1)NC(=O)OC(C)(C)C)C(=O)N[C@@H](CC1CCCCC1)[C@@H](O)[C@@H](O)CC(C)C
InChI Key InChIKey=CSTWSEPSGWXLDX-BRHZJGCFSA-N
Data  2 IC50
  Tab Delimited (TSV)   2D SDfile   Computed 3D by Vconf -m prep SDfile
Find this compound or compounds like it in BindingDB:
Activity Spreadsheet -- Enzyme Inhibition Constant Data from BindingDB
Found 2 hits for monomerid = 50407088
TargetEndothelin-converting enzyme 1(Rattus norvegicus (Rat))
Abbott Laboratories
Curated by ChEMBL
LigandPNGBDBM50407088(CHEMBL2112255)
Affinity DataIC50:  11nM. Assay description: Inhibition of conversion of big endothelial-1 (Big ET-1) to ET-1 by endothelin converting enzyme(ECE) in rat lung membrane.
In DepthDetails ArticlePubMed
TargetCathepsin D(Bos taurus)
Abbott Laboratories
Curated by ChEMBL
LigandPNGBDBM50407088(CHEMBL2112255)
Affinity DataIC50:  55nM. Assay description: Inhibition of conversion of hemoglobin by commercially purchased bovine spleen cathepsin D.
In DepthDetails ArticlePubMed