BDBM50407089 CHEMBL2112253
SMILES CC[C@H](C)[C@H](NC(=O)[C@H](CC1CCCCC1)NC(C)=O)C(=O)N[C@@H](Cc1ccc2ccccc2c1)[C@@H](O)[C@@H](O)CC(C)C
InChI Key InChIKey=LQCJJENFTPZACS-CKMCQWPASA-N
Data  2 IC50
  Tab Delimited (TSV)   2D SDfile   Computed 3D by Vconf -m prep SDfile
Find this compound or compounds like it in BindingDB:
Activity Spreadsheet -- Enzyme Inhibition Constant Data from BindingDB
Found 2 hits for monomerid = 50407089
TargetEndothelin-converting enzyme 1(Rattus norvegicus (Rat))
Abbott Laboratories
Curated by ChEMBL
LigandPNGBDBM50407089(CHEMBL2112253)
Affinity DataIC50:  4.20nM. Assay description: Inhibition of conversion of big endothelial-1 (Big ET-1) to ET-1 by endothelin converting enzyme(ECE) in rat lung membrane.
In DepthDetails ArticlePubMed
TargetCathepsin D(Bos taurus)
Abbott Laboratories
Curated by ChEMBL
LigandPNGBDBM50407089(CHEMBL2112253)
Affinity DataIC50:  180nM. Assay description: Inhibition of conversion of hemoglobin by commercially purchased bovine spleen cathepsin D.
In DepthDetails ArticlePubMed