BDBM50407303 CHEMBL36688
SMILES OC(=O)c1ccc(cc1)C(=O)c1ccc(Cc2ccc(cc2)C(F)(F)F)cc1
InChI Key InChIKey=DMKAZTDVPJQRAJ-UHFFFAOYSA-N
Data  1 KI
  Tab Delimited (TSV)   2D SDfile   Computed 3D by Vconf -m prep SDfile
Find this compound or compounds like it in BindingDB:
Activity Spreadsheet -- Enzyme Inhibition Constant Data from BindingDB
Found 1 hit for monomerid = 50407303
Target3-oxo-5-alpha-steroid 4-dehydrogenase 2(Homo sapiens (Human))
Smithkline Beecham Pharmaceuticals
Curated by ChEMBL
LigandPNGBDBM50407303(CHEMBL36688)
Affinity DataKi:  30nM. Assay description: Inhibition constant against recombinant human Steroid 5-alpha-reductase type 2 expressed in CHO cells
In DepthDetails ArticlePubMed