BDBM50407304 CHEMBL289822
SMILES Cc1ccc(Cc2ccc(cc2)C(=O)c2ccc(cc2)C(O)=O)cc1
InChI Key InChIKey=YOQGUYTYRVMLFY-UHFFFAOYSA-N
Data  1 KI
  Tab Delimited (TSV)   2D SDfile   Computed 3D by Vconf -m prep SDfile
Find this compound or compounds like it in BindingDB:
Activity Spreadsheet -- Enzyme Inhibition Constant Data from BindingDB
Found 1 hit for monomerid = 50407304
Target3-oxo-5-alpha-steroid 4-dehydrogenase 2(Homo sapiens (Human))
Smithkline Beecham Pharmaceuticals
Curated by ChEMBL
LigandPNGBDBM50407304(CHEMBL289822)
Affinity DataKi:  15nM. Assay description: Inhibition constant against recombinant human Steroid 5-alpha-reductase type 2 expressed in CHO cells
In DepthDetails ArticlePubMed