BDBM50407319 CHEMBL431904
SMILES OC(=O)c1ccc(cc1)C(=O)c1ccc(cc1)C(=O)c1ccc(cc1)[N+]([O-])=O
InChI Key InChIKey=GNFJSZALBYKAJJ-UHFFFAOYSA-N
Data  1 KI
  Tab Delimited (TSV)   2D SDfile   Computed 3D by Vconf -m prep SDfile
Find this compound or compounds like it in BindingDB:
Activity Spreadsheet -- Enzyme Inhibition Constant Data from BindingDB
Found 1 hit for monomerid = 50407319
Target3-oxo-5-alpha-steroid 4-dehydrogenase 2(Homo sapiens (Human))
Smithkline Beecham Pharmaceuticals
Curated by ChEMBL
LigandPNGBDBM50407319(CHEMBL431904)
Affinity DataKi:  100nM. Assay description: Inhibition constant against recombinant human Steroid 5-alpha-reductase type 2 expressed in CHO cells
In DepthDetails ArticlePubMed