BDBM50408016 RO-053061::Ro-05-3061
SMILES Fc1ccc2NC(=O)CN=C(c3ccccc3)c2c1
InChI Key InChIKey=BHRKXOYRRFPATI-UHFFFAOYSA-N
Data  1 IC50
  Tab Delimited (TSV)   2D SDfile   Computed 3D by Vconf -m prep SDfile
Find this compound or compounds like it in BindingDB:
Activity Spreadsheet -- Enzyme Inhibition Constant Data from BindingDB
Found 1 hit for monomerid = 50408016
TargetTranslocator protein(Homo sapiens (Human))
Harvard University
Curated by ChEMBL
LigandPNGBDBM50408016(RO-053061 | Ro-05-3061)
Affinity DataIC50:  2.50E+7nM. Assay description: Binding affinity of compound towards Benzodiazepine receptor in a competition assay
In DepthDetails ArticlePubMed