BDBM50408019 CHEMBL356900::Ro-13-3780
SMILES CN1c2ccc(Br)cc2C(=NCC1=O)c1c(F)cccc1F
InChI Key InChIKey=XXPNMKPARHVBIY-UHFFFAOYSA-N
Data  1 IC50
  Tab Delimited (TSV)   2D SDfile   Computed 3D by Vconf -m prep SDfile
Find this compound or compounds like it in BindingDB:
Activity Spreadsheet -- Enzyme Inhibition Constant Data from BindingDB
Found 1 hit for monomerid = 50408019
TargetTranslocator protein(Homo sapiens (Human))
Harvard University
Curated by ChEMBL
LigandPNGBDBM50408019(CHEMBL356900 | Ro-13-3780)
Affinity DataIC50:  4.16E+8nM. Assay description: Binding affinity of compound towards Benzodiazepine receptor in a competition assay
In DepthDetails ArticlePubMed