BDBM50408031 CHEMBL151121::Ro-20-1815
SMILES CN1c2ccc(N)cc2C(=NCC1=O)c1ccccc1F
InChI Key InChIKey=LTCDLGUFORGHGY-UHFFFAOYSA-N
Data  1 IC50
  Tab Delimited (TSV)   2D SDfile   Computed 3D by Vconf -m prep SDfile
Find this compound or compounds like it in BindingDB:
Activity Spreadsheet -- Enzyme Inhibition Constant Data from BindingDB
Found 1 hit for monomerid = 50408031
TargetTranslocator protein(Homo sapiens (Human))
Harvard University
Curated by ChEMBL
LigandPNGBDBM50408031(CHEMBL151121 | Ro-20-1815)
Affinity DataIC50:  1.53E+7nM. Assay description: Binding affinity of compound towards Benzodiazepine receptor in a competition assay
In DepthDetails ArticlePubMed