BDBM50408047 CHEMBL3038096
SMILES [#7]-[#6@@H](-[#6]-[#6]-[#6]\[#7]=[#6](\[#7])-[#7])-[#6](=O)-[#7]-[#6@@H](-[#6]-[#6]-[#6]\[#7]=[#6](/[#7])-[#7])-[#6](=O)-[#7]-1-[#6]-[#6]-[#6]-[#6@H]-1-[#6](=O)-[#7]-1-[#6]-[#6@H](-[#8])-[#6]-[#6@H]-1-[#6](=O)-[#7]-[#6]-[#6](=O)-[#7]-[#6@@H](-[#6]-c1cccs1)-[#6](=O)-[#7]-[#6@@H](-[#6]-[#8])-[#6](=O)-[#7]-[#6@H](-[#6]-c1ccccc1)-[#6](=O)-[#7](-[#6]-[#6](=O)-[#7]-[#6@@H](-[#6]-[#6]-[#6]\[#7]=[#6](/[#7])-[#7])-[#6](-[#8])=O)-[#6]-1-[#6]-[#6]-[#6]-[#6]-[#6]-1
InChI Key InChIKey=GLGIPOFSNUBXAM-QSBTYHCNSA-N
Data  1 IC50  1 Kd
  Tab Delimited (TSV)   2D SDfile   Computed 3D by Vconf -m prep SDfile
Find this compound or compounds like it in BindingDB:
Activity Spreadsheet -- Enzyme Inhibition Constant Data from BindingDB
Found 2 hits for monomerid = 50408047
TargetB1 bradykinin receptor(Homo sapiens (Human))
Cortech
Curated by ChEMBL
LigandPNGBDBM50408047(CHEMBL3038096)
Affinity DataIC50:  3.02E+3nM. Assay description: In vitro Bradykinin receptor B1 antagonist activity in functional tissue within rabbit aorta
In DepthDetails ArticlePubMed
TargetB2 bradykinin receptor(RAT)
Cortech
Curated by ChEMBL
LigandPNGBDBM50408047(CHEMBL3038096)
Affinity DataKd:  18.6nM. Assay description: In vitro Bradykinin receptor B2 antagonist activity by using rat uterus functional assay
In DepthDetails ArticlePubMed