BDBM50408113 CHEMBL2069072
SMILES C[C@@H]1O[C@@H](O[C@H]2CC[C@@]3(C)[C@H](CC[C@@H]4[C@@H]3CC[C@]3(C)[C@@H]5CC[C@]43OC5)C2)[C@H](O)[C@H](O)[C@H]1O
InChI Key InChIKey=SMJSWMXEZJOEFB-IXBOSMKSSA-N
Data  1 IC50
  Tab Delimited (TSV)   2D SDfile   Computed 3D by Vconf -m prep SDfile
Find this compound or compounds like it in BindingDB:
Activity Spreadsheet -- Enzyme Inhibition Constant Data from BindingDB
Found 1 hit for monomerid = 50408113
TargetSodium/potassium-transporting ATPase subunit alpha-1(Canis familiaris)
University Of Manitoba
Curated by ChEMBL
LigandPNGBDBM50408113(CHEMBL2069072)
Affinity DataIC50:  2.20E+3nM. Assay description: Inhibition of [3H]ouabain binding to Digitalis receptor in dog heart microsomes
In DepthDetails ArticlePubMed