BDBM50408117 CHEMBL2069066
SMILES COC(C[N+]([O-])=O)[C@H]1CC[C@]2(O)[C@@H]3CC[C@@H]4C[C@H](CC[C@]4(C)[C@H]3CC[C@]12C)O[C@@H]1O[C@@H](C)[C@H](O)[C@@H](O)[C@H]1O
InChI Key InChIKey=NZPPFWNGXFPUDB-FFDXZMNMSA-N
Data  1 IC50
  Tab Delimited (TSV)   2D SDfile   Computed 3D by Vconf -m prep SDfile
Find this compound or compounds like it in BindingDB:
Activity Spreadsheet -- Enzyme Inhibition Constant Data from BindingDB
Found 1 hit for monomerid = 50408117
TargetSodium/potassium-transporting ATPase subunit alpha-1(Canis familiaris)
University Of Manitoba
Curated by ChEMBL
LigandPNGBDBM50408117(CHEMBL2069066)
Affinity DataIC50:  30nM. Assay description: Inhibition of [3H]ouabain binding to Digitalis receptor in dog heart microsomes
In DepthDetails ArticlePubMed