BDBM50408120 CHEMBL2069071
SMILES C[C@@H]1O[C@@H](O[C@H]2CC[C@@]3(C)[C@H](CC[C@@H]4[C@@H]3CC[C@]3(C)[C@@H](CC[C@]43O)C(O)C[N+]([O-])=O)C2)[C@H](O)[C@H](O)[C@H]1O
InChI Key InChIKey=BGEAHUBWHARRCM-RBMLXQFFSA-N
Data  1 IC50
  Tab Delimited (TSV)   2D SDfile   Computed 3D by Vconf -m prep SDfile
Find this compound or compounds like it in BindingDB:
Activity Spreadsheet -- Enzyme Inhibition Constant Data from BindingDB
Found 1 hit for monomerid = 50408120
TargetSodium/potassium-transporting ATPase subunit alpha-1(Canis familiaris)
University Of Manitoba
Curated by ChEMBL
LigandPNGBDBM50408120(CHEMBL2069071)
Affinity DataIC50:  4.73E+3nM. Assay description: Inhibition of [3H]ouabain binding to Digitalis receptor in dog heart microsomes
In DepthDetails ArticlePubMed