BDBM50408273 CHEMBL2112522
SMILES C[C@]12CC[C@H]3[C@@H](CC=C4C[C@@H](O)CC[C@]34C)[C@@H]1CC=C2c1ncc[nH]1
InChI Key InChIKey=SSLMEQBZDUXKMH-CSOYKPOESA-N
Data  2 IC50
  Tab Delimited (TSV)   2D SDfile   Computed 3D by Vconf -m prep SDfile
Find this compound or compounds like it in BindingDB:
Activity Spreadsheet -- Enzyme Inhibition Constant Data from BindingDB
Found 2 hits for monomerid = 50408273
TargetSteroid 17-alpha-hydroxylase/17,20 lyase(Rattus norvegicus (Rat))
University Of Maryland
Curated by ChEMBL
LigandPNGBDBM50408273(CHEMBL2112522)
Affinity DataIC50:  1.50E+3nM. Assay description: Inhibition of rat testicual micrososmal Cytochrome P450 17A1
In DepthDetails ArticlePubMed
TargetSteroid 17-alpha-hydroxylase/17,20 lyase(Homo sapiens (Human))
University Of Maryland
Curated by ChEMBL
LigandPNGBDBM50408273(CHEMBL2112522)
Affinity DataIC50:  21nM. Assay description: Inhibition of human testicular microsomal Cytochrome P450 17A1
In DepthDetails ArticlePubMed