BDBM50408275 CHEMBL2068885
SMILES [#6][C@]12[#6]-[#6]-[#6@H]3-[#6@@H](-[#6]-[#6]-[#6@@H]4-[#6]-[#6@@H](-[#8])-[#6]-[#6][C@]34[#6])[C@@]1([#8])[#6]-[#6]-[#6@@H]2-[#6]=[#7]\[#7]=[#6](\[#7])-[#7]
InChI Key InChIKey=OAFIVRUVYWMTHX-JYTYACEASA-N
Data  1 IC50
  Tab Delimited (TSV)   2D SDfile   Computed 3D by Vconf -m prep SDfile
Find this compound or compounds like it in BindingDB:
Activity Spreadsheet -- Enzyme Inhibition Constant Data from BindingDB
Found 1 hit for monomerid = 50408275
TargetSodium/potassium-transporting ATPase subunit alpha-1(Canis familiaris)
Prassis Istituto Di Ricerche Sigma-Tau
Curated by ChEMBL
LigandPNGBDBM50408275(CHEMBL2068885)
Affinity DataIC50:  1.58E+3nM. Assay description: Inhibition of Na+/K+ ATPase from dog kidney
In DepthDetails ArticlePubMed