BDBM50408503 CHEMBL38659::US9504692, 3918
SMILES CNCCCN1c2ccccc2Sc2ccccc12
InChI Key InChIKey=WOCOVPRTRIBGFZ-UHFFFAOYSA-N
Data  1 IC50
  Tab Delimited (TSV)   2D SDfile   Computed 3D by Vconf -m prep SDfile
Find this compound or compounds like it in BindingDB:
Activity Spreadsheet -- Enzyme Inhibition Constant Data from BindingDB
Found 1 hit for monomerid = 50408503
LigandPNGBDBM50408503(CHEMBL38659 | US9504692, 3918)
Affinity DataIC50:  4.00E+3nMT: 2°C. Assay description: To screen for small molecular weight compounds that can inhibit MALT1 protease activity, recombinant GSTMALT1 was purified from E. coli to establish ...
In DepthDetails US Patent