BDBM50408584 CHEMBL137998
SMILES CCOc1ccc2cccc(CCNC(C)=O)c2c1
InChI Key InChIKey=BCGDPNIAQGAMSI-UHFFFAOYSA-N
Data  1 IC50
  Tab Delimited (TSV)   2D SDfile   Computed 3D by Vconf -m prep SDfile
Find this compound or compounds like it in BindingDB:
Activity Spreadsheet -- Enzyme Inhibition Constant Data from BindingDB
Found 1 hit for monomerid = 50408584
TargetMelatonin receptor type 1A(Homo sapiens (Human))
Universit£
Curated by ChEMBL
LigandPNGBDBM50408584(CHEMBL137998)
Affinity DataIC50:  0.794nM. Assay description: Melatonin receptor type 1A binding affinity measured using 2-[125I]iodomelatonin on ovine pars tuberalis membrane homogenates.
In DepthDetails ArticlePubMed