BDBM50408624 CHEMBL138468
SMILES COc1nccc2c(CCNC(C)=O)coc12
InChI Key InChIKey=BBESWRZUFKHHNS-UHFFFAOYSA-N
Data  1 IC50
  Tab Delimited (TSV)   2D SDfile   Computed 3D by Vconf -m prep SDfile
Find this compound or compounds like it in BindingDB:
Activity Spreadsheet -- Enzyme Inhibition Constant Data from BindingDB
Found 1 hit for monomerid = 50408624
TargetMelatonin receptor type 1A(Homo sapiens (Human))
Universit£
Curated by ChEMBL
LigandPNGBDBM50408624(CHEMBL138468)
Affinity DataIC50:  1.00E+4nM. Assay description: Melatonin receptor type 1A binding affinity measured using 2-[125I]iodomelatonin on ovine pars tuberalis membrane homogenates.
In DepthDetails ArticlePubMed