BDBM50408646 CHEMBL138807
SMILES COc1ccc2cccc(C(CO)CNC(C)=O)c2c1
InChI Key InChIKey=ACRFALLEPRLOAU-UHFFFAOYSA-N
Data  1 IC50
  Tab Delimited (TSV)   2D SDfile   Computed 3D by Vconf -m prep SDfile
Find this compound or compounds like it in BindingDB:
Activity Spreadsheet -- Enzyme Inhibition Constant Data from BindingDB
Found 1 hit for monomerid = 50408646
TargetMelatonin receptor type 1A(Homo sapiens (Human))
Universit£
Curated by ChEMBL
LigandPNGBDBM50408646(CHEMBL138807)
Affinity DataIC50:  19.9nM. Assay description: Melatonin receptor type 1A binding affinity measured using 2-[125I]iodomelatonin on ovine pars tuberalis membrane homogenates.
In DepthDetails ArticlePubMed