BDBM50409011 CHEMBL45711
SMILES COc1cccc(c1)-c1cc(O)c2c(Cl)ccnc2n1
InChI Key InChIKey=DVZYOSQGJXHFPO-UHFFFAOYSA-N
Data  1 IC50
  Tab Delimited (TSV)   2D SDfile   Computed 3D by Vconf -m prep SDfile
Find this compound or compounds like it in BindingDB:
Activity Spreadsheet -- Enzyme Inhibition Constant Data from BindingDB
Found 1 hit for monomerid = 50409011
TargetTubulin alpha-1A chain(Sus scrofa (Pig))
University Of North Carolina At Chapel Hill
Curated by ChEMBL
LigandPNGBDBM50409011(CHEMBL45711)
Affinity DataIC50:  724nM. Assay description: Inhibition of tubulin polymerization interacting at the colchicine binding site.
In DepthDetails ArticlePubMed