BDBM50409024 CHEMBL48525
SMILES COc1cccc(c1)C1=Nc2ncccc2C(C)C1
InChI Key InChIKey=WQCOSHFKQQAUAW-UHFFFAOYSA-N
Data  1 IC50
  Tab Delimited (TSV)   2D SDfile   Computed 3D by Vconf -m prep SDfile
Find this compound or compounds like it in BindingDB:
Activity Spreadsheet -- Enzyme Inhibition Constant Data from BindingDB
Found 1 hit for monomerid = 50409024
TargetTubulin alpha-1A chain(Sus scrofa (Pig))
University Of North Carolina At Chapel Hill
Curated by ChEMBL
LigandPNGBDBM50409024(CHEMBL48525)
Affinity DataIC50:  617nM. Assay description: Inhibition of tubulin polymerization interacting at the colchicine binding site.
In DepthDetails ArticlePubMed