BDBM50409040 CHEMBL2111948
SMILES C[C@]12CC[C@H]3[C@@H](CC=C4CC(=O)CC[C@]34C)[C@@H]1CC[C@@H]2[C@H]1CN1
InChI Key InChIKey=IRGXYIWQWVWOAI-WYLBFHJUSA-N
Data  3 IC50
  Tab Delimited (TSV)   2D SDfile   Computed 3D by Vconf -m prep SDfile
Find this compound or compounds like it in BindingDB:
Activity Spreadsheet -- Enzyme Inhibition Constant Data from BindingDB
Found 3 hits for monomerid = 50409040
TargetSteroid 17-alpha-hydroxylase/17,20 lyase(Homo sapiens (Human))
University Of The Saarland
Curated by ChEMBL
LigandPNGBDBM50409040(CHEMBL2111948)
Affinity DataIC50:  1.52E+3nM. Assay description: Tested for inhibitory activity against Cytochrome P450 17 from human testicular microsomes
In DepthDetails ArticlePubMed
TargetSteroid 17-alpha-hydroxylase/17,20 lyase(Rattus norvegicus (Rat))
University Of The Saarland
Curated by ChEMBL
LigandPNGBDBM50409040(CHEMBL2111948)
Affinity DataIC50:  420nM. Assay description: Tested for inhibitory activity against Cytochrome P450 17 from rat testicular microsomes
In DepthDetails ArticlePubMed
Target3-oxo-5-alpha-steroid 4-dehydrogenase 2(Homo sapiens (Human))
University Of The Saarland
Curated by ChEMBL
LigandPNGBDBM50409040(CHEMBL2111948)
Affinity DataIC50:  1.60E+4nM. Assay description: Inhibition of steroid 5-alpha-reductase type II isozyme
In DepthDetails ArticlePubMed