BDBM50409684 CHEMBL2111565
SMILES Oc1ccc(cc1Cl)C(=O)N\N=C\c1cccc2c(OCc3ccc(OC(F)(F)F)cc3)cccc12
InChI Key InChIKey=VEHKHQXOBRPGMA-XAZZYMPDSA-N
Data  1 IC50
  Tab Delimited (TSV)   2D SDfile   Computed 3D by Vconf -m prep SDfile
Find this compound or compounds like it in BindingDB:
Activity Spreadsheet -- Enzyme Inhibition Constant Data from BindingDB
Found 1 hit for monomerid = 50409684
TargetGlucagon receptor(Homo sapiens (Human))
Novo Nordisk
Curated by ChEMBL
LigandPNGBDBM50409684(CHEMBL2111565)
Affinity DataIC50:  12.9nM. Assay description: In vitro binding affinity for recombinant human glucagon receptor (hGGR) in BHK cells
In DepthDetails ArticlePubMed