BDBM50409838 CHEMBL127330
SMILES Sc1cc(Cl)c(cc1S(=O)(=O)Nc1nncn1-c1ccc(Cl)cc1)C(=O)Nc1ccccc1
InChI Key InChIKey=XPRKYESSVNGXIG-UHFFFAOYSA-N
Data  2 IC50
  Tab Delimited (TSV)   2D SDfile   Computed 3D by Vconf -m prep SDfile
Find this compound or compounds like it in BindingDB:
Activity Spreadsheet -- Enzyme Inhibition Constant Data from BindingDB
Found 2 hits for monomerid = 50409838
TargetIntegrase(Human immunodeficiency virus 1)
University Of Southern California
Curated by ChEMBL
LigandPNGBDBM50409838(CHEMBL127330)
Affinity DataIC50:  1.20E+4nM. Assay description: Inhibitory activity against DNA strand transfer by HIV integrase
In DepthDetails ArticlePubMed
TargetIntegrase(Human immunodeficiency virus 1)
University Of Southern California
Curated by ChEMBL
LigandPNGBDBM50409838(CHEMBL127330)
Affinity DataIC50:  6.03E+3nM. Assay description: Inhibitory activity against 3' processing by HIV integrase
In DepthDetails ArticlePubMed